2013-03-29 5 views
0

Я пытаюсь установить плагин с использованием Maven (пакетный импортер для neo4j). ИспользованиеОшибка Maven Plugin: не удалось выполнить тесты

mvn clean compile assembly:single 

Дал мне ошибку, что каталог не может быть создан. Я изменил его:

sudo mvn clean compile package assembly:single 

и, казалось, работать, пока строить не удалось из-за следующих тестов:

[INFO] BUILD FAILURE 
[INFO] ------------------------------------------------------------------------ 
[INFO] Total time: 27.798s 
[INFO] Finished at: Fri Mar 29 16:17:14 EDT 2013 
[INFO] Final Memory: 22M/949M 
[INFO] ------------------------------------------------------------------------ 
[ERROR] Failed to execute goal org.apache.maven.plugins:maven-surefire-plugin:2.10:test (default-test) on project batch-import: There are test failures. 
[ERROR] 
[ERROR] Please refer to /u/omusayev/batch-import/batch-import/target/surefire-reports for the individual test results. 
[ERROR] -> [Help 1] 
[ERROR] 
[ERROR] To see the full stack trace of the errors, re-run Maven with the -e switch. 
[ERROR] Re-run Maven using the -X switch to enable full debug logging. 
[ERROR] 
[ERROR] For more information about the errors and possible solutions, please read the following articles: 
[ERROR] [Help 1] http://cwiki.apache.org/confluence/display/MAVEN/MojoFailureException 

Никогда не перед использованием Maven, это довольно загадочно. Кто-нибудь имеет представление о том, что это может означать, и как я могу решить проблему? Если я могу предоставить дополнительную информацию, пожалуйста, спросите.

спасибо.

ответ

2

Вы кончили фактические испытания отказа (которые выше фрагменте кода вы вставили), но я предполагаю, что это какая-то странность в тесте, который не имеет большого значения - попробуйте это:

sudo mvn clean compile package assembly:single -Dmaven.test.skip=true 
+0

Совершенство , Спасибо. Будем надеяться, что все будет работать ... –

Смежные вопросы